site stats

Openfoam recipe for target failed

Web12 de dez. de 2015 · How to correct this error make: *** [install-recursive] Error 1. I am trying to install clicky which is part of click modular router. When I run sudo ./configure … Web19 de fev. de 2024 · Recipe for target failed Ask Question Asked 3 years, 1 month ago Modified 3 years, 1 month ago Viewed 12k times 1 Basically It is supposed to calculate the Federal Income of the user. But anytime I run it to see what is no doubt a baragge of structure errors I get this MakeFile

Compile problem:recipe for target

Web5 de ago. de 2024 · Stack Exchange Network. Stack Exchange network consists of 181 Q&A communities including Stack Overflow, the largest, most trusted online community … Web18 de set. de 2016 · I'm receiving following error. I have no clue what to do due to little experience with C. After research I found this similar error Cygwin - Makefile-error: … software that extracts audio from video https://mdbrich.com

0002074: Compilation failed when WM_LABEL_SIZE=64 is set

Web2 de set. de 2024 · Seems as wmake can not find the ParaView source files. Did you extract and build PV 5.4.1 in thirdparty dir ? Maybe you should ask this in the OF forum as it is not directly related to liggghts. Web2 de mai. de 2024 · make[3]: command not found (See next post) Have you installed the build prerequisites? It's V=s to get verbosity in the build (upper case). software that identifies chips and components

PVReader in the OpenFOAM5.x cannot make with Paraview 5.4.0

Category:c - Building GCC make: *** [all] Error 2 - Stack Overflow

Tags:Openfoam recipe for target failed

Openfoam recipe for target failed

OpenFOAM v2206

Web22 de jul. de 2024 · If OpenFOAM is installed in the $HOME/OpenFOAM directory, the user should: EITHER if running bash or ksh (if in doubt type echo $SHELL ), source the etc/bashrc file by adding the following line to the end of your $HOME/.bashrc file: source $HOME/OpenFOAM/OpenFOAM-8/etc/bashrc then type “ source $HOME/.bashrc ” in … WebThe way i installed OpenFoam was to avoid using the super-user password which is needed for installing the packages. Which means that the sudo Zypper install would not work for …

Openfoam recipe for target failed

Did you know?

WebThe presence of the Foam::List::List(InputIterator, InputIterator) constructor often causes problem in 64-bit due to overloading resolution issues. Web20 de abr. de 2016 · Originally I attempted to compile with the default settings for bashrc file where set to 64 by default, for 2nd attempt set to 32 for cOpt and c++Opt files -mfloat-abi=softfp for 2nd attempt set to -mfloat-abi=hard.

Web0002220: Compiling error: recipe for target 'mesh' failed: Description: I have been following the compiling instructions described in http://openfoam.org/download/source/. … Web1 de mai. de 2016 · 1st May 2016. OpenFOAM Repo: 3. Setting the Environment. Environment variable settings for OpenFOAM are contained in files in the OpenFOAM-dev/etc directory. To compile OpenFOAM, the user must ‘source’ the environment, either the bashrc file if they are running the bash or ksh shell, or the cshrc file if they are …

Web21 de dez. de 2024 · Trying to built the adapter from the FSI branch with OpenFOAM v1812, I found at least the following error: Making dependency list for source file Force.C … Web20 de nov. de 2024 · Stack Exchange Network. Stack Exchange network consists of 181 Q&A communities including Stack Overflow, the largest, most trusted online community for developers to learn, share their knowledge, and build their careers.. Visit Stack Exchange

WebOpenCFD is pleased to announce the June 2024 release of OpenFOAM® v2206. This release extends OpenFOAM-v2112 features across many areas of the code. The new functionality represents development sponsored by OpenCFD's customers, internally funded developments, and integration of features and changes from the OpenFOAM community.

Web19 de fev. de 2024 · The text was updated successfully, but these errors were encountered: software that enhances visual presentationsWeb5 de fev. de 2024 · The snippet is enough to go on; if it is part of a rule, Make is somehow failing to parse the first line of the rule correctly, and if it is not part of a rule, line 91 should not be a command and should not begin with a TAB. – Beta Jan 2, 2016 at 9:06 1 The question is what comes BEFORE this in the makefile? slow moving triangle signWeb29 de ago. de 2024 · When run the commond: (darknet) learner@learner-pc:~/darknet/include/opencv/build$ make -j12 Then,there are problems in list: [ 80%] Built target opencv_test_core Makefile:160: recipe for target 'all' failed make: *** [all] Error 2 Ubuntu 16.04.5 CUDA Version 9.0.176 Thank you very much. Comments slow moving triangle vehicle signsWeb17 de jun. de 2015 · For convenience I'm pasting it here: Run these (adjust bs= and count= to the amount of swap you want) sudo dd if=/dev/zero of=/swapfile bs=64M count=16 sudo mkswap /swapfile sudo swapon /swapfile That should let you compile your code. But make sure you then revert the swapon after compilation, with these: sudo swapoff /swapfile … slow moving vehWeb12 de set. de 2016 · From there, browse to Settings -> Local Drive Mode and double-click on Create Substitute Drive Letter X. This will create a pseudo-virtual drive letter X: which … slow moving triangleWebDear. I gave up to use trusty on this OF-ver. but xenial is in use. The following log was taken after ./Allwmake.log.make.tar.gz How can I... slow moving turtle gifWeb3 de jul. de 2015 · 1 Answer Sorted by: 2 Firstly, check that you really have Open MPI installed. Secondly, check that OpenFOAM is properly set to use Open MPI: see corresponding options in etc/bashrc (or etc/cshrc ). slow moving vehicle